{"text_format":"2","workbook":"xlsx","n_sheets":6,"sheets":["Руководство","1.Внесение данных","2. Результат оценки","Справочник","Доп.формулы для кер_стекло","Ед. измерения"],"not_rendered":{"charts":0,"images":0,"macros":0,"external_links":0,"defined_names":0,"comments":0,"pivot_tables":0},"unopened":[],"bounds":{"document_bytes":16777216,"sheet_cells":100000,"run_cost":"one","rows_first":2000,"rows_last":500,"rows_between":2000,"halvings":0,"cell_chars":16384,"cell_head_chars":4096},"cells_cut":0,"cells_raw":0,"read":"whole","date_system":"1900"}

{"sheet":"Руководство","index":0,"n_rows":15,"n_cols":2,"rows_kept":15,"cut":false,"hidden":false,"merged":[[3,1,3,13],[5,1,5,13],[6,1,6,13],[7,1,7,13],[8,1,8,13],[9,1,9,13],[10,1,10,13],[11,1,11,13],[12,1,12,13],[13,1,13,13]]}
[]
[null,"Руководство по использованию инструмента"]
[]
[null,"Данный инструмент разработан для предварительной оценки необходимости подачи отчётности о выбросах парниковых газов в соответствии с Постановлением Правительства РФ от 20.04.2022 № 707 (ред. от 29.10.2022).\nМетодологическая база инструмента включает:\n• Приказ Минприроды России № 371;\n• Распоряжение Правительства РФ № 2979-р;\n• Постановление Правительства РФ № 707.\nРезультаты, полученные с использованием данного инструмента, носят информационный характер и не освобождают компанию от обязательства самостоятельной проверки данных перед подачей официальной отчётности."]
[null,"Порядок работы с инструментом"]
[null,"1. Заполнение исходных данных\nОсновной рабочий лист — «Внесение данных».\nВнесите данные за отчетный год по каждому блоку таблиц.\n• Ячейки, подлежащие обязательному заполнению, отмечены цветной заливкой. Заливка исчезает после ввода данных.\n• Убедитесь, что введенные данные корректны и соответствуют требуемым единицам измерения."]
[null,"2. Сжигание топлива на котельных и генерация энергии\nНа листе «Внесение данных», в таблице «Внесение данных по сжиганию на котельных, объектах генерации энергии, в том числе резервных»:\n• В столбце «Единица измерения» выберите значение из выпадающего списка (тонны, тыс м³, литры и др.).\n• После выбора проверьте столбец «Коэффициент перевода в единицы по Постановлению Правительства № 707»:\n  o Если выводится «-», смените единицу измерения на иную, пока коэффициент не примет числовое значение.\n  o Для видов топлива с предустановленным коэффициентом 0,001 данные вносятся в тоннах."]
[null,"3. Сжигание топлива в транспорте\n• Аналогично заполните таблицу «Внесение данных по сжиганию топлива в транспорте».\n• Убедитесь в корректности выбранных единиц измерения и коэффициентов."]
[null,"4. Обработка, сжигание и захоронение отходов\nЕсли ваша компания не передает отходы сторонним организациям, а проводит их обработку/сжигание/захоронение самостоятельно — заполните таблицу «Внесение данных по обработке, сжиганию и захоронению твердых отходов»."]
[null,"5. Производство керамических изделий\nЕсли компания ведет такую деятельность, внесите информацию в таблицу «Внесение данных по производству керамических изделий».\nВ графах «Содержание карбоната в минеральном сырье» и «Степень кальцинирования карбоната» значения указываются в долях, то есть от 0 до 1 без указания знака % (например, 0,75)."]
[null,"6. Производство стекла\nЕсли компания ведет такую деятельность, внесите информацию в таблицу «Внесение данных по производству стекла».\nВ графе «Степень кальцинирования карбоната» значения указываются в долях, то есть от 0 до 1 без указания знака % (например, 0,75)."]
[null,"7. Проверка данных\nПосле внесения всех значений проверьте:\n• корректность данных;\n• соответствие единиц измерения;\n• отсутствие пустых обязательных ячеек."]
[null,"8. Анализ результатов\n• Перейдите на лист «Результат оценки».\n• Ознакомьтесь с суммарными выбросами организации в тоннах CO₂-эквивалента.\n• Если результат превышает 50 000 т CO₂-экв., согласно 296-ФЗ и ПП РФ №707 соответствует критерию подачи отчётности в ГИС «Энергоэффективность» в срок до 1 июля года, следующего за отчетным. "]
[null,"Важные замечания\n• Инструмент предоставляет ориентировочную оценку и не заменяет официальных расчётов.\n• Ответственность за корректность исходных данных лежит на пользователе.\n• Непредставление отчётности при обязательстве её подачи может повлечь ответственность в соответствии с КоАП РФ.\n• С более подробной информацией по критериям подачи корректной отчетности можно ознакомиться напрямую на портале ГИС «Энергоэффективность»."]
[null,"Ссылка на портал ГИС \"Энергоэффективность\""]

{"sheet":"1.Внесение данных","index":1,"n_rows":84,"n_cols":6,"rows_kept":84,"cut":false,"hidden":false,"merged":[[34,1,34,4]]}
[]
[null,"1. Внесение данных"]
[null,"Внесите данные в столбец D для всех применимых блоков таблиц."]
[null,"Данные вносятся за последний отчетный год."]
[null,"Выберите необходимые единицы измерения."]
[null,"Коэффициенты в таблицах подтянутся автоматически."]
[]
[null,"Внесение данных по сжиганию на котельных, объектах генерации энергии, в том числе резервных"]
[]
[null,"Тип топлива","Единица измерения","Данные для внесения","Коэффициент перевода в единицы по Постановлению Правительства № 707"]
[null,"Газ горючий природный (естественный)","Необходимо заполнить",null,{"$f":"IFERROR(INDEX(Справочник!$C$181:$E$210,MATCH('1.Внесение данных'!B11,Справочник!$B$181:$B$210,0),MATCH('1.Внесение данных'!C11,Справочник!$C$179:$E$179,0)),\"Нет коэффициента\")","v":"Нет коэффициента"},{"$f":"IF(C11=\"Необходимо заполнить\",(IF(D11>0, \"Пожалуйста, выберите единицу измерения\", \"\")),\"\")","v":""}]
[null,"Газ сжиженный","Необходимо заполнить",null,{"$f":"IFERROR(INDEX(Справочник!$C$181:$E$210,MATCH('1.Внесение данных'!B12,Справочник!$B$181:$B$210,0),MATCH('1.Внесение данных'!C12,Справочник!$C$179:$E$179,0)),\"Нет коэффициента\")","v":"Нет коэффициента"},{"$f":"IF(C12=\"Необходимо заполнить\",(IF(D12>0, \"Пожалуйста, выберите единицу измерения\", \"\")),\"\")","v":""}]
[null,"Пропан и бутан сжиженные, газы углеводородные и их смеси сжиженные","Необходимо заполнить",null,{"$f":"IFERROR(INDEX(Справочник!$C$181:$E$210,MATCH('1.Внесение данных'!B13,Справочник!$B$181:$B$210,0),MATCH('1.Внесение данных'!C13,Справочник!$C$179:$E$179,0)),\"Нет коэффициента\")","v":"Нет коэффициента"},""]
[null,"Газ попутный нефтяной (нефтяные месторождения)","Необходимо заполнить",null,{"$f":"IFERROR(INDEX(Справочник!$C$181:$E$210,MATCH('1.Внесение данных'!B14,Справочник!$B$181:$B$210,0),MATCH('1.Внесение данных'!C14,Справочник!$C$179:$E$179,0)),\"Нет коэффициента\")","v":"Нет коэффициента"},""]
[null,"Газ попутный нефтяной (газоконденсатные месторождения)","Необходимо заполнить",null,{"$f":"IFERROR(INDEX(Справочник!$C$181:$E$210,MATCH('1.Внесение данных'!B15,Справочник!$B$181:$B$210,0),MATCH('1.Внесение данных'!C15,Справочник!$C$179:$E$179,0)),\"Нет коэффициента\")","v":"Нет коэффициента"},""]
[null,"Газ попутный нефтяной (газовые месторождения)","Необходимо заполнить",null,{"$f":"IFERROR(INDEX(Справочник!$C$181:$E$210,MATCH('1.Внесение данных'!B16,Справочник!$B$181:$B$210,0),MATCH('1.Внесение данных'!C16,Справочник!$C$179:$E$179,0)),\"Нет коэффициента\")","v":"Нет коэффициента"},""]
[null,"Газ горючий искусственный доменный","Необходимо заполнить",null,{"$f":"IFERROR(INDEX(Справочник!$C$181:$E$210,MATCH('1.Внесение данных'!B17,Справочник!$B$181:$B$210,0),MATCH('1.Внесение данных'!C17,Справочник!$C$179:$E$179,0)),\"Нет коэффициента\")","v":"Нет коэффициента"},""]
[null,"Кокс металлургический","Необходимо заполнить",null,{"$f":"IFERROR(INDEX(Справочник!$C$181:$E$210,MATCH('1.Внесение данных'!B18,Справочник!$B$181:$B$210,0),MATCH('1.Внесение данных'!C18,Справочник!$C$179:$E$179,0)),\"Нет коэффициента\")","v":"Нет коэффициента"},""]
[null,"Кокс нефтяной и сланцевый","Необходимо заполнить",null,{"$f":"IFERROR(INDEX(Справочник!$C$181:$E$210,MATCH('1.Внесение данных'!B19,Справочник!$B$181:$B$210,0),MATCH('1.Внесение данных'!C19,Справочник!$C$179:$E$179,0)),\"Нет коэффициента\")","v":"Нет коэффициента"},""]
[null,"Мазут (мазут топочный)","Необходимо заполнить",null,{"$f":"IFERROR(INDEX(Справочник!$C$181:$E$210,MATCH('1.Внесение данных'!B20,Справочник!$B$181:$B$210,0),MATCH('1.Внесение данных'!C20,Справочник!$C$179:$E$179,0)),\"Нет коэффициента\")","v":"Нет коэффициента"},""]
[null,"Антрацит","Необходимо заполнить",null,1E-3,""]
[null,"Коксующийся уголь","Необходимо заполнить",null,1E-3,""]
[null,"Каменный уголь","Необходимо заполнить",null,1E-3,""]
[null,"Уголь бурый","Необходимо заполнить",null,{"$f":"IFERROR(INDEX(Справочник!$C$181:$E$210,MATCH('1.Внесение данных'!B24,Справочник!$B$181:$B$210,0),MATCH('1.Внесение данных'!C24,Справочник!$C$179:$E$179,0)),\"Нет коэффициента\")","v":"Нет коэффициента"},""]
[null,"Торф топливный","Необходимо заполнить",null,1E-3,""]
[null,"Брикеты и полубрикеты торфяные","Необходимо заполнить",null,1E-3,""]
[null,"Дизельное топливо","Необходимо заполнить",null,{"$f":"IFERROR(INDEX(Справочник!$C$181:$E$210,MATCH('1.Внесение данных'!B27,Справочник!$B$181:$B$210,0),MATCH('1.Внесение данных'!C27,Справочник!$C$179:$E$179,0)),\"Нет коэффициента\")","v":"Нет коэффициента"},{"$f":"IF(C27=\"Необходимо заполнить\",(IF(D27>0, \"Пожалуйста, выберите единицу измерения\", \"\")),\"\")","v":""}]
[]
[null,"Внесение данных по сжиганию топлива в транспорте"]
[]
{"$rows_left_out":55}
{"sheet":"2. Результат оценки","index":2,"n_rows":55,"n_cols":10,"rows_kept":55,"cut":false,"hidden":false,"merged":[[32,2,32,9],[48,2,48,9],[30,1,31,1],[11,2,11,9],[54,2,54,9],[12,1,28,1],[49,1,53,1],[33,1,47,1],[29,2,29,9],[49,2,50,2],[49,3,50,3],[49,4,50,4],[3,6,3,7],[9,7,9,8],[9,1,10,2],[9,3,9,4],[9,5,9,6]]}
[]
[null,null,"2. Результат оценки"]
[]
[null,null,"Итоговое значение массы выбросов, \nтонны CO2-экв.",{"$f":"SUM(J13:J29,J31:J32,J34:J48,J50:J54)","v":0},"Необходимость подавать отчетность",{"$f":"IF(D4>50000, \"Да\", \"Нет\")","v":"Нет"},{"$f":"IF(F4=\"Да\",\"C более подробной информацией по критериям подачи отчетности рекомендуется ознакомиться на портале ГИС «Энергоэффективность»\",\"\")","v":""}]
[]
[null,"Ниже представлен подробный результат расчета на основании данных, внесенных на листе \"1.Внесение данных\"."]
[]
[null,"Форма отчета о выбросах парниковых газов"]
[]
[null,"Производственные процессы и виды деятельности",null,"Показатели производственных процессов и видов деятельности за отчетный период",null,"Конверсионный коэффициент, тонн CO2-экв. на единицу потребляемого энергоресурса/производимой продукции",null,"Масса выбросов по парниковым газам",null,"Общая масса выбросов парниковых газов, тонн"]
[null,null,null,"наименование показателя","значение показателя","парниковый газ","значение коэффициента","тонн","тонн CO2-экв.","CO2-экв."]
[null,"1.","Стационарное сжигание газообразного, жидкого и твердого топлива, включая следующие виды топлива"]
[null,null,"газ горючий природный (естественный)","суммарный расход топлива, млн. куб. м",{"$f":"IF(ISNUMBER('1.Внесение данных'!D11*'1.Внесение данных'!E11), '1.Внесение данных'!D11*'1.Внесение данных'!E11, 0)","v":0},"CO2",{"$f":"VLOOKUP(C13,Справочник!$B$43:$I$130,5,0)","v":1.59},{"$f":"E13*G13*VLOOKUP('2. Результат оценки'!C13,Справочник!$B$43:$I$129, 3,FALSE)*1000","v":0},{"$f":"H13","v":0},{"$f":"I13","v":0}]
[null,null,"газ сжиженный","суммарный расход топлива, тыс. тонн",{"$f":"IF(ISNUMBER('1.Внесение данных'!D12*'1.Внесение данных'!E12), '1.Внесение данных'!D12*'1.Внесение данных'!E12, 0)","v":0},"CO2",{"$f":"VLOOKUP(C14,Справочник!$B$43:$I$130,5,0)","v":1.65},{"$f":"E14*G14*VLOOKUP('2. Результат оценки'!C14,Справочник!$B$43:$I$129, 3,FALSE)*1000","v":0},{"$f":"H14","v":0},0]
[null,null,"пропан и бутан сжиженные, газы углеводородные и их смеси сжиженные","суммарный расход топлива, млн. куб. м",{"$f":"IF(ISNUMBER('1.Внесение данных'!D13*'1.Внесение данных'!E13), '1.Внесение данных'!D13*'1.Внесение данных'!E13, 0)","v":0},"CO2",{"$f":"VLOOKUP(C15,Справочник!$B$43:$I$130,5,0)","v":1.85},{"$f":"E15*G15*VLOOKUP('2. Результат оценки'!C15,Справочник!$B$43:$I$129, 3,FALSE)*1000","v":0},0,0]
[null,null,"газ попутный нефтяной (нефтяные месторождения)","суммарный расход топлива, млн. куб. м",{"$f":"IF(ISNUMBER('1.Внесение данных'!D14*'1.Внесение данных'!E14), '1.Внесение данных'!D14*'1.Внесение данных'!E14, 0)","v":0},"CO2",{"$f":"VLOOKUP(C16,Справочник!$B$43:$I$130,5,0)","v":1.77},{"$f":"E16*G16*VLOOKUP('2. Результат оценки'!C16,Справочник!$B$43:$I$129, 3,FALSE)*1000","v":0},0,0]
[null,null,"газ попутный нефтяной (газоконденсатные месторождения)","суммарный расход топлива, млн. куб. м",{"$f":"IF(ISNUMBER('1.Внесение данных'!D15*'1.Внесение данных'!E15), '1.Внесение данных'!D15*'1.Внесение данных'!E15, 0)","v":0},"CO2",{"$f":"VLOOKUP(C17,Справочник!$B$43:$I$130,5,0)","v":1.64},{"$f":"E17*G17*VLOOKUP('2. Результат оценки'!C17,Справочник!$B$43:$I$129, 3,FALSE)*1000","v":0},0,0]
[null,null,"газ попутный нефтяной \n(газовые месторождения)","суммарный расход топлива, млн. куб. м",{"$f":"IF(ISNUMBER('1.Внесение данных'!D16*'1.Внесение данных'!E16), '1.Внесение данных'!D16*'1.Внесение данных'!E16, 0)","v":0},"CO2",{"$f":"VLOOKUP(C18,Справочник!$B$43:$I$130,5,0)","v":1.62},{"$f":"E18*G18*VLOOKUP('2. Результат оценки'!C18,Справочник!$B$43:$I$129, 3,FALSE)*1000","v":0},0,0]
[null,null,"газ горючий искусственный доменный","суммарный расход топлива, тыс. куб. м",{"$f":"IF(ISNUMBER('1.Внесение данных'!D17*'1.Внесение данных'!E17), '1.Внесение данных'!D17*'1.Внесение данных'!E17, 0)","v":0},"CO2",{"$f":"VLOOKUP(C19,Справочник!$B$43:$I$130,5,0)","v":7.62},{"$f":"E19*G19*VLOOKUP('2. Результат оценки'!C19,Справочник!$B$43:$I$129, 3,FALSE)","v":0},0,0]
[null,null,"кокс металлургический","суммарный расход топлива, тыс. тонн",{"$f":"IF(ISNUMBER('1.Внесение данных'!D18*'1.Внесение данных'!E18), '1.Внесение данных'!D18*'1.Внесение данных'!E18, 0)","v":0},"CO2",{"$f":"VLOOKUP(C20,Справочник!$B$43:$I$130,5,0)","v":3.14},{"$f":"E20*G20*VLOOKUP('2. Результат оценки'!C20,Справочник!$B$43:$I$129, 3,FALSE)*1000","v":0},0,0]
[null,null,"кокс нефтяной и сланцевый","суммарный расход топлива, тыс. тонн",{"$f":"IF(ISNUMBER('1.Внесение данных'!D19*'1.Внесение данных'!E19), '1.Внесение данных'!D19*'1.Внесение данных'!E19, 0)","v":0},"CO2",{"$f":"VLOOKUP(C21,Справочник!$B$43:$I$130,5,0)","v":2.86},{"$f":"E21*G21*VLOOKUP('2. Результат оценки'!C21,Справочник!$B$43:$I$129, 3,FALSE)*1000","v":0},0,{"$f":"I21","v":0}]
[null,null,"мазут топочный","суммарный расход топлива, тыс. тонн",{"$f":"IF(ISNUMBER('1.Внесение данных'!D20*'1.Внесение данных'!E20), '1.Внесение данных'!D20*'1.Внесение данных'!E20, 0)","v":0},"CO2",{"$f":"VLOOKUP(C22,Справочник!$B$43:$I$130,5,0)","v":2.27},{"$f":"E22*G22*VLOOKUP('2. Результат оценки'!C22,Справочник!$B$43:$I$129, 3,FALSE)*1000","v":0},{"$f":"H22","v":0},{"$f":"I22","v":0}]
[null,null,"антрацит","суммарный расход топлива, тыс. тонн",{"$f":"IF(ISNUMBER('1.Внесение данных'!D21*'1.Внесение данных'!E21), '1.Внесение данных'!D21*'1.Внесение данных'!E21, 0)","v":0},"CO2",{"$f":"VLOOKUP(C23,Справочник!$B$43:$I$130,5,0)","v":2.88},{"$f":"E23*G23*VLOOKUP('2. Результат оценки'!C23,Справочник!$B$43:$I$129, 3,FALSE)*1000","v":0},{"$f":"H23","v":0},{"$f":"I23","v":0}]
[null,null,"коксующийся уголь","суммарный расход топлива, тыс. тонн",{"$f":"IF(ISNUMBER('1.Внесение данных'!D22*'1.Внесение данных'!E22), '1.Внесение данных'!D22*'1.Внесение данных'!E22, 0)","v":0},"CO2",{"$f":"VLOOKUP(C24,Справочник!$B$43:$I$130,5,0)","v":2.77},{"$f":"E24*G24*VLOOKUP('2. Результат оценки'!C24,Справочник!$B$43:$I$129, 3,FALSE)*1000","v":0},{"$f":"H24","v":0},{"$f":"I24","v":0}]
[null,null,"каменный уголь","суммарный расход топлива, тыс. тонн",{"$f":"IF(ISNUMBER('1.Внесение данных'!D23*'1.Внесение данных'!E23), '1.Внесение данных'!D23*'1.Внесение данных'!E23, 0)","v":0},"CO2",{"$f":"VLOOKUP(C25,Справочник!$B$43:$I$130,5,0)","v":2.77},{"$f":"E25*G25*VLOOKUP('2. Результат оценки'!C25,Справочник!$B$43:$I$129, 3,FALSE)*1000","v":0},{"$f":"H25","v":0},{"$f":"I25","v":0}]
[null,null,"бурый уголь","суммарный расход топлива, тыс. тонн",{"$f":"IF(ISNUMBER('1.Внесение данных'!D24*'1.Внесение данных'!E24), '1.Внесение данных'!D24*'1.Внесение данных'!E24, 0)","v":0},"CO2",{"$f":"VLOOKUP(C26,Справочник!$B$43:$I$130,5,0)","v":2.96},{"$f":"E26*G26*VLOOKUP('2. Результат оценки'!C26,Справочник!$B$43:$I$129, 3,FALSE)*1000","v":0},{"$f":"H26","v":0},{"$f":"I26","v":0}]
[null,null,"торф топливный","суммарный расход топлива, тыс. тонн",{"$f":"IF(ISNUMBER('1.Внесение данных'!D25*'1.Внесение данных'!E25), '1.Внесение данных'!D25*'1.Внесение данных'!E25, 0)","v":0},"CO2",{"$f":"VLOOKUP(C27,Справочник!$B$43:$I$130,5,0)","v":3.11},{"$f":"E27*G27*VLOOKUP('2. Результат оценки'!C27,Справочник!$B$43:$I$129, 3,FALSE)*1000","v":0},{"$f":"H27","v":0},{"$f":"I27","v":0}]
[null,null,"брикеты и полубрикеты торфяные","суммарный расход топлива, тыс. тонн",{"$f":"IF(ISNUMBER('1.Внесение данных'!D26*'1.Внесение данных'!E26), '1.Внесение данных'!D26*'1.Внесение данных'!E26, 0)","v":0},"CO2",{"$f":"VLOOKUP(C28,Справочник!$B$43:$I$130,5,0)","v":3.11},{"$f":"E28*G28*VLOOKUP('2. Результат оценки'!C28,Справочник!$B$43:$I$129, 3,FALSE)*1000","v":0},{"$f":"H28","v":0},{"$f":"I28","v":0}]
[null,null,"топливо дизельное","суммарный расход топлива, тыс. тонн",{"$f":"IF(ISNUMBER('1.Внесение данных'!D27*'1.Внесение данных'!E27), '1.Внесение данных'!D27*'1.Внесение данных'!E27, 0)","v":0},"CO2",{"$f":"VLOOKUP(C29,Справочник!$B$43:$I$130,5,0)","v":2.17},{"$f":"E29*G29*VLOOKUP('2. Результат оценки'!C29,Справочник!$B$43:$I$129, 3,FALSE)*1000","v":0},{"$f":"H29","v":0},{"$f":"I29","v":0}]
[null,"2.","Производство минеральных материалов"]
{"$rows_left_out":26}
{"sheet":"Справочник","index":3,"n_rows":265,"n_cols":10,"rows_kept":265,"cut":false,"hidden":true,"merged":[[213,6,214,6],[215,6,248,6],[252,2,252,3],[252,4,252,5],[253,2,253,3],[253,4,253,5],[252,1,254,1],[245,1,245,5],[198,1,198,5],[179,1,179,5],[194,1,194,5],[213,1,214,1],[213,2,213,4],[213,5,214,5],[233,1,233,5],[242,1,242,5],[171,1,171,5],[133,5,135,5],[139,6,140,6],[141,6,174,6],[118,1,118,8],[121,1,121,8],[125,1,125,8],[139,1,140,1],[139,2,139,4],[139,5,140,5],[139,7,140,7],[4,4,38,4],[44,9,128,9],[42,9,43,9],[159,1,159,5],[168,1,168,5],[42,5,42,6],[42,7,42,8],[44,1,44,8],[70,1,70,8],[110,1,110,8],[114,1,114,8],[71,1,71,8],[28,1,28,3],[42,1,43,1],[42,2,42,4],[8,1,8,3]]}
[]
[null,"Перечень парниковых газов, в отношении которых осуществляется государственный учёт выбросов парниковых газов и ведение кадастра парниковых газов"]
[]
[null,"Наименование \nпарникового газа \n(коммерческое наименование)","Химическая формула","Коэффициент пересчета величин выбросов парниковых газов в эквивалент диоксида углерода (на горизонте \n100 лет)","Источник"]
[null,"Диоксид углерода","CO2",1,"Распоряжение Правительства РФ от 22.10.2021 N 2979-р (ред. от 04.04.2025) \"Об утверждении перечня парниковых газов, в отношении которых осуществляется государственный учет выбросов парниковых газов \nи ведение кадастра парниковых газов\""]
[null,"Метан","CH4",28]
[null,"Закись азота\n(монооксид диазота)","N2O",265]
[null,"Гексафторид серы","SF6",23500]
[null,"Гидрофторуглероды (ГФУ)"]
[null,"ГФУ-23\nтрифторметан","CHF3",12400]
[null,"ГФУ-32\nдифторметан","CH2F2",677]
[null,"ГФУ-41\nфторметан","CH3F",116]
[null,"ГФУ-43-10mee\n1,1,1,2,2,3,4,5,5,5-декафторпентан","C5H2F10\n(CF3CHFCHFCF2CF3)",1650]
[null,"ГФУ-125\nпентафторэтан","CHF2CF3",3170]
[null,"ГФУ-134\n1,1,2,2-тетрафторэтан","C2H2F4\n(CHF2CHF2)",1120]
[null,"ГФУ-134a\n1,1,1,2-тетрафторэтан","CH2FCF3",1300]
[null,"ГФУ-143\n1,1,2-трифторэтан","CH2FCHF2",328]
[null,"ГФУ-143a\n1,1,1-трифторэтан","CH3CF3",4800]
[null,"ГФУ-152\n1,2-дифторэтан","C2H4F2(CH2FCH2F)",16]
[null,"ГФУ-152а\n1,1-дифторэтан","C2H4F2(CH3CHF2)",138]
[null,"ГФУ-161\nфторэтан","C2H5F(CH3CH2F)",4]
[null,"ГФУ-227ea\n1,1,1,2,3,3,3-гептафторпропан","C3HF7(CF3CHFCF3)",3350]
[null,"ГФУ-236cb\n1,1,1,2,2,3-гексафторпропан","C3H2F6(CH2FCF2CF3)",1210]
[null,"ГФУ-236ea\n1,1,1,2,3,3-гексафторпропан","C3H2F6(CHF2CHFCF3)",1330]
[null,"ГФУ-236fa\n1,1,1,3,3,3-гексафторпропан","C3H2F6(CF3CH2CF3)",8060]
[null,"ГФУ-245ca\n1,1,2,2,3-пентафторпропан","CH2FCF2CHF2",716]
[null,"ГФУ-245fa\n1,1,1,3,3-пентафторпропан","C3H3F5(CHF2CH2CF3)",858]
[null,"ГФУ-365mfc\n1,1,1,3,3-пентафторбутан","CH3CF2CH2CF3",804]
[null,"Перфторуглероды (ПФУ)"]
[null,"ПФУ-14\nтетрафторметан (перфторметан)","CF4",6630]
{"$rows_left_out":236}
{"sheet":"Доп.формулы для кер_стекло","index":4,"n_rows":20,"n_cols":3,"rows_kept":20,"cut":false,"hidden":true,"merged":[]}
[]
[null,"На данном листе приведены дополнительные формулы для расчета выбросов по производству стекла и керамики."]
[]
[null,"Выбросы от керамических изделий"]
[]
[null,"Наименование","Выбросы"]
[null,"CaCO3",{"$f":"'1.Внесение данных'!D60*'1.Внесение данных'!D64*'1.Внесение данных'!D68*Справочник!C262","v":0}]
[null,"MgCO3",{"$f":"'1.Внесение данных'!D61*'1.Внесение данных'!D65*'1.Внесение данных'!D69*Справочник!C263","v":0}]
[null,"CaMg(CO3) 2",{"$f":"'1.Внесение данных'!D62*'1.Внесение данных'!D66*'1.Внесение данных'!D70*Справочник!C264","v":0}]
[null,"FeCO3",{"$f":"'1.Внесение данных'!D63*'1.Внесение данных'!D67*'1.Внесение данных'!D71*Справочник!C265","v":0}]
[null,"Итого",{"$f":"SUM(C7:C10)","v":0}]
[]
[null,"Выбросы от производства стекла"]
[]
[null,"Наименование","Выбросы"]
[null,"CaCO3",{"$f":"'1.Внесение данных'!D77*'1.Внесение данных'!D81*Справочник!C262","v":0}]
[null,"MgCO3",{"$f":"'1.Внесение данных'!D78*'1.Внесение данных'!D82*Справочник!C263","v":0}]
[null,"CaMg(CO3) 2",{"$f":"'1.Внесение данных'!D79*'1.Внесение данных'!D83*Справочник!C264","v":0}]
[null,"FeCO3",{"$f":"'1.Внесение данных'!D80*'1.Внесение данных'!D84*Справочник!C265","v":0}]
[null,"Итого",{"$f":"SUM(C16:C19)","v":0}]

{"sheet":"Ед. измерения","index":5,"n_rows":4,"n_cols":1,"rows_kept":4,"cut":false,"hidden":true,"merged":[]}
["тыс м^3"]
["л"]
["т"]
["Необходимо заполнить"]